Target
Type-1/Type-2 angiotensin II receptor
Ligand
BDBM50005347
Substrate
Meas. Tech.
ChEMBL_36175 (CHEMBL646987)
IC50
2300±n/a nM
Citation
 Thomas, APAllott, CPGibson, KHMajor, JSMasek, BBOldham, AARatcliffe, AHRoberts, DARussell, STThomason, DA New nonpeptide angiotensin II receptor antagonists. 1. Synthesis, biological properties, and structure-activity relationships of 2-alkyl benzimidazole derivatives. J Med Chem 35:877-85 (1992)  
Target
Name:
Type-1/Type-2 angiotensin II receptor
Synonyms:
Angiotensin II receptor
Type:
Mol. Mass.:
Description:
ASSAY_ID of ChEMBL is 357784
Components:
This complex has 2 components.
Component 1
Name:
Type-1 angiotensin II receptor
Synonyms:
AGTR1 AGTR1B AT1 AT1BR AT2R1B Angiotensin II receptor Type-1 angiotensin II receptor (AT1)
Type:
Protein
Mol. Mass.:
41080.75
Organism:
Homo sapiens (Human)
Description:
P30556
Residue:
359
  
Component 2
Name:
Type-2 angiotensin II receptor
Synonyms:
AGTR2 AT2 Angiotensin II type 2 (AT-2) receptor Type-2 angiotensin II receptor
Type:
Enzyme Catalytic Domain
Mol. Mass.:
41201.61
Organism:
Homo sapiens (Human)
Description:
Angiotensin II, central 0 0::P50052
Residue:
363
  
Inhibitor
Name:
BDBM50005347
Synonyms:
4'-((2-butyl-1H-benzo[d]imidazol-1-yl)methyl)biphenyl-2-carboxylic acid 4'-(2-Butyl-benzoimidazol-1-ylmethyl)-biphenyl-2-carboxylic acid;0.25H2O | CHEMBL7632
Type:
Small organic molecule
Emp. Form.:
C25H24N2O2
Mol. Mass.:
384.4703
SMILES:
CCCCc1nc2ccccc2n1Cc1ccc(cc1)-c1ccccc1C(O)=O
: