Target
Type-1/Type-2 angiotensin II receptor
Ligand
BDBM50003399
Substrate
Meas. Tech.
ChEMBL_36175 (CHEMBL646987)
IC50
480±n/a nM
Citation
 Thomas, APAllott, CPGibson, KHMajor, JSMasek, BBOldham, AARatcliffe, AHRoberts, DARussell, STThomason, DA New nonpeptide angiotensin II receptor antagonists. 1. Synthesis, biological properties, and structure-activity relationships of 2-alkyl benzimidazole derivatives. J Med Chem 35:877-85 (1992)  
Target
Name:
Type-1/Type-2 angiotensin II receptor
Synonyms:
Angiotensin II receptor
Type:
Mol. Mass.:
Description:
ASSAY_ID of ChEMBL is 357784
Components:
This complex has 2 components.
Component 1
Name:
Type-1 angiotensin II receptor
Synonyms:
AGTR1 AGTR1B AT1 AT1BR AT2R1B Angiotensin II receptor Type-1 angiotensin II receptor (AT1)
Type:
Protein
Mol. Mass.:
41080.75
Organism:
Homo sapiens (Human)
Description:
P30556
Residue:
359
  
Component 2
Name:
Type-2 angiotensin II receptor
Synonyms:
AGTR2 AT2 Angiotensin II type 2 (AT-2) receptor Type-2 angiotensin II receptor
Type:
Enzyme Catalytic Domain
Mol. Mass.:
41201.61
Organism:
Homo sapiens (Human)
Description:
Angiotensin II, central 0 0::P50052
Residue:
363
  
Inhibitor
Name:
BDBM50003399
Synonyms:
4'-(2-Butyl-4-chloro-5-hydroxymethyl-imidazol-1-ylmethyl)-biphenyl-2-carboxylic acid 4-Chloro-5-hydroxymethyl-3-imidazol-1-ylmethyl-biphenyl-2-carboxylic acid butyl ester i4'-(2-Butyl-4-chloro-5-hydroxymethyl-imidazol-1-ylmethyl)-biphenyl-2-carboxylic acid | {2-Butyl-5-chloro-3-[2'-(2H-tetrazol-5-yl)-biphenyl-4-ylmethyl]-3H-imidazol-4-yl}-methanol (EXP7711 (IMI))
Type:
Small organic molecule
Emp. Form.:
C22H23ClN2O3
Mol. Mass.:
398.883
SMILES:
CCCCc1nc(Cl)c(CO)n1Cc1ccc(cc1)-c1ccccc1C(O)=O
: