Target
Trace amine-associated receptor 1
Ligand
BDBM50359505
Substrate
Meas. Tech.
ChEMBL_1643986 (CHEMBL3992915)
EC50
1690±n/a nM
Citation
 Tonelli, MEspinoza, SGainetdinov, RRCichero, E Novel biguanide-based derivatives scouted as TAAR1 agonists: Synthesis, biological evaluation, ADME prediction and molecular docking studies. Eur J Med Chem 127:781-792 (2017)  
Target
Name:
Trace amine-associated receptor 1
Synonyms:
TA1 TAAR1_HUMAN TRAR1 | trace amine-associated receptor 1
Type:
PROTEIN
Mol. Mass.:
39107.47
Organism:
Homo sapiens (Human)
Description:
ChEMBL_792734
Residue:
339
  
Inhibitor
Name:
BDBM50359505
Synonyms:
CHEMBL1182312
Type:
Small organic molecule
Emp. Form.:
C14H14INO2
Mol. Mass.:
355.1709
SMILES:
NCCc1ccc(Oc2ccc(O)cc2)c(I)c1
: