Target
Trace amine-associated receptor 1
Ligand
BDBM50227351
Substrate
Meas. Tech.
ChEMBL_1643990 (CHEMBL3992919)
EC50
>10000±n/a nM
Citation
 Tonelli, MEspinoza, SGainetdinov, RRCichero, E Novel biguanide-based derivatives scouted as TAAR1 agonists: Synthesis, biological evaluation, ADME prediction and molecular docking studies. Eur J Med Chem 127:781-792 (2017)  
Target
Name:
Trace amine-associated receptor 1
Synonyms:
TA1 TAAR1_HUMAN TRAR1 | trace amine-associated receptor 1
Type:
PROTEIN
Mol. Mass.:
39107.47
Organism:
Homo sapiens (Human)
Description:
ChEMBL_792734
Residue:
339
  
Inhibitor
Name:
BDBM50227351
Synonyms:
CHEMBL3628706
Type:
Small organic molecule
Emp. Form.:
C9H13N5
Mol. Mass.:
191.233
SMILES:
NC(=N)NC(=N)NCc1ccccc1
: