Target
Trace amine-associated receptor 5
Ligand
BDBM50227830
Substrate
Meas. Tech.
ChEMBL_1643991 (CHEMBL3992920)
EC50
>10000±n/a nM
Citation
 Tonelli, MEspinoza, SGainetdinov, RRCichero, E Novel biguanide-based derivatives scouted as TAAR1 agonists: Synthesis, biological evaluation, ADME prediction and molecular docking studies. Eur J Med Chem 127:781-792 (2017)  
Target
Name:
Trace amine-associated receptor 5
Synonyms:
Gm227 TaR-5 Trace amine receptor 5 Trimethylamine receptor | mTaar5
Type:
PROTEIN
Mol. Mass.:
38230.08
Organism:
Mus musculus
Description:
ChEMBL_116770
Residue:
337
  
Inhibitor
Name:
BDBM50227830
Synonyms:
CHEMBL4099661
Type:
Small organic molecule
Emp. Form.:
C8H10FN5
Mol. Mass.:
195.1969
SMILES:
[#7]\[#6](-[#7])=[#7]\[#6](\[#7])=[#7]\c1cccc(F)c1
: