Target
Trace amine-associated receptor 1
Ligand
BDBM50227828
Substrate
Meas. Tech.
ChEMBL_1643988 (CHEMBL3992917)
EC50
1800±n/a nM
Citation
 Tonelli, MEspinoza, SGainetdinov, RRCichero, E Novel biguanide-based derivatives scouted as TAAR1 agonists: Synthesis, biological evaluation, ADME prediction and molecular docking studies. Eur J Med Chem 127:781-792 (2017)  
Target
Name:
Trace amine-associated receptor 1
Synonyms:
TAAR1_MOUSE Taar1 Trace amine receptor 1 (TARR1) Trace amine-associated receptor1 | Trar1
Type:
Protein
Mol. Mass.:
37635.41
Organism:
Mus musculus (Mouse)
Description:
Q923Y8
Residue:
332
  
Inhibitor
Name:
BDBM50227828
Synonyms:
CHEMBL4068661
Type:
Small organic molecule
Emp. Form.:
C9H14BrCl2N5
Mol. Mass.:
343.051
SMILES:
Cl.Cl.[#7]\[#6](-[#7])=[#7]\[#6](\[#7])=[#7]\[#6]-c1cccc(Br)c1
: