Target
Glycine receptor subunit alpha-3
Ligand
BDBM50229711
Substrate
Meas. Tech.
ChEMBL_1644302 (CHEMBL3993231)
Kd
190±n/a nM
Citation
 Bregman, HSimard, JRAndrews, KLAyube, SChen, HGunaydin, HGuzman-Perez, AHu, JHuang, LHuang, XKrolikowski, PHLehto, SGLewis, RTMichelsen, KPegman, PPlant, MHShaffer, PLTeffera, YYi, SZhang, MGingras, JDiMauro, EF The Discovery and Hit-to-Lead Optimization of Tricyclic Sulfonamides as Potent and Efficacious Potentiators of Glycine Receptors. J Med Chem 60:1105-1125 (2017)  
Target
Name:
Glycine receptor subunit alpha-3
Synonyms:
GLRA3 Glycine receptor alpha-3/beta
Type:
PROTEIN
Mol. Mass.:
53809.29
Organism:
Homo sapiens (Human)
Description:
ChEMBL_967474
Residue:
464
  
Inhibitor
Name:
BDBM50229711
Synonyms:
CHEMBL4074873
Type:
Small organic molecule
Emp. Form.:
C19H17N3O4S
Mol. Mass.:
383.421
SMILES:
[H][C@@]12CN(C[C@]1([H])c1cnccc1N(C)C2=O)S(=O)(=O)c1ccc2occc2c1
: