Target
Peptidyl-prolyl cis-trans isomerase A
Ligand
BDBM50230210
Substrate
Meas. Tech.
ChEMBL_1644715 (CHEMBL3993644)
Ki
16±n/a nM
Citation
 Steadman, VAPettit, SBPoullennec, KGLazarides, LKeats, AJDean, DKStanway, SJAustin, CASanvoisin, JAWatt, GMFliri, HGLiclican, ACJin, DWong, MHLeavitt, SALee, YJTian, YFrey, CRAppleby, TCSchmitz, UJansa, PMackman, RLSchultz, BE Discovery of Potent Cyclophilin Inhibitors Based on the Structural Simplification of Sanglifehrin A. J Med Chem 60:1000-1017 (2017)  
Target
Name:
Peptidyl-prolyl cis-trans isomerase A
Synonyms:
CYPA Cyclophilin A PPIA PPIase A Rotamase A
Type:
Protein
Mol. Mass.:
18015.32
Organism:
Homo sapiens (Human)
Description:
P62937
Residue:
165
  
Inhibitor
Name:
BDBM50230210
Synonyms:
CHEMBL4090107
Type:
Small organic molecule
Emp. Form.:
C34H50N4O8
Mol. Mass.:
642.7828
SMILES:
CO[C@H]1\C=C\C=C\CCOC(=O)[C@@H]2CCCN(N2)C(=O)[C@H](Cc2cccc(O)c2)NC(=O)[C@@H](NC(=O)[C@H](C)[C@H](OC)[C@H]1C)C(C)C
: