Target
Cannabinoid receptor 1
Ligand
BDBM50230385
Substrate
Meas. Tech.
ChEMBL_1644839 (CHEMBL3993768)
Ki
7±n/a nM
Citation
 Iyer, MRCinar, RKatz, AGao, MErdelyi, KJourdan, TCoffey, NJPacher, PKunos, G Design, Synthesis, and Biological Evaluation of Novel, Non-Brain-Penetrant, Hybrid Cannabinoid CB J Med Chem 60:1126-1141 (2017)  
Target
Name:
Cannabinoid receptor 1
Synonyms:
Brain-type cannabinoid receptor CB-R CNR1_MOUSE Cannabinoid receptor | Cnr1
Type:
Enzyme
Mol. Mass.:
52842.52
Organism:
Mus musculus (Mouse)
Description:
P47746
Residue:
473
  
Inhibitor
Name:
BDBM50230385
Synonyms:
CHEMBL4103682
Type:
Small organic molecule
Emp. Form.:
C27H27Cl2N5O2S
Mol. Mass.:
556.507
SMILES:
CC(C)(C)C(\N)=N/C(=N\S(=O)(=O)c1ccc(Cl)cc1)/N1CC(C(=N1)c1ccc(Cl)cc1)c1ccccc1
: