Target
Glucagon receptor
Ligand
BDBM50230577
Substrate
Meas. Tech.
ChEMBL_1644922 (CHEMBL3993851)
IC50
>30000±n/a nM
Citation
 Nance, KDDays, ELWeaver, CDColdren, AFarmer, TDCho, HPNiswender, CMBlobaum, ALNiswender, KDLindsley, CW Discovery of a Novel Series of Orally Bioavailable and CNS Penetrant Glucagon-like Peptide-1 Receptor (GLP-1R) Noncompetitive Antagonists Based on a 1,3-Disubstituted-7-aryl-5,5-bis(trifluoromethyl)-5,8-dihydropyrimido[4,5-d]pyrimidine-2,4(1H,3H)-dione Core. J Med Chem 60:1611-1616 (2017)  
Target
Name:
Glucagon receptor
Synonyms:
GCGR GLR_HUMAN Glucagon receptor (GlucR)
Type:
Enzyme
Mol. Mass.:
54026.92
Organism:
Homo sapiens (Human)
Description:
P47871
Residue:
477
  
Inhibitor
Name:
BDBM50230577
Synonyms:
CHEMBL4095693
Type:
Small organic molecule
Emp. Form.:
C21H13ClF6N4O3
Mol. Mass.:
518.796
SMILES:
COc1cccc(c1)C1=NC(c2c(N1)n(-c1ccc(Cl)cc1)c(=O)[nH]c2=O)(C(F)(F)F)C(F)(F)F
: