Target
Glucagon-like peptide 1 receptor
Ligand
BDBM50230576
Substrate
Meas. Tech.
ChEMBL_1644915 (CHEMBL3993844)
IC50
692±n/a nM
Citation
 Nance, KDDays, ELWeaver, CDColdren, AFarmer, TDCho, HPNiswender, CMBlobaum, ALNiswender, KDLindsley, CW Discovery of a Novel Series of Orally Bioavailable and CNS Penetrant Glucagon-like Peptide-1 Receptor (GLP-1R) Noncompetitive Antagonists Based on a 1,3-Disubstituted-7-aryl-5,5-bis(trifluoromethyl)-5,8-dihydropyrimido[4,5-d]pyrimidine-2,4(1H,3H)-dione Core. J Med Chem 60:1611-1616 (2017)  
Target
Name:
Glucagon-like peptide 1 receptor
Synonyms:
GLP-1 receptor GLP-1R GLP1R_HUMAN Glucagon-like peptide 1 receptor (GLP-1)
Type:
Enzyme
Mol. Mass.:
53035.78
Organism:
Homo sapiens (Human)
Description:
P43220
Residue:
463
  
Inhibitor
Name:
BDBM50230576
Synonyms:
CHEMBL1341270
Type:
Small organic molecule
Emp. Form.:
C16H11ClF6N4O2
Mol. Mass.:
440.728
SMILES:
Cn1c2N=C(NC(c2c(=O)n(C)c1=O)(C(F)(F)F)C(F)(F)F)c1ccc(Cl)cc1
: