Target
Cytochrome P450 1A2
Ligand
BDBM50230576
Substrate
Meas. Tech.
ChEMBL_1644925 (CHEMBL3993854)
IC50
4010±n/a nM
Citation
 Nance, KDDays, ELWeaver, CDColdren, AFarmer, TDCho, HPNiswender, CMBlobaum, ALNiswender, KDLindsley, CW Discovery of a Novel Series of Orally Bioavailable and CNS Penetrant Glucagon-like Peptide-1 Receptor (GLP-1R) Noncompetitive Antagonists Based on a 1,3-Disubstituted-7-aryl-5,5-bis(trifluoromethyl)-5,8-dihydropyrimido[4,5-d]pyrimidine-2,4(1H,3H)-dione Core. J Med Chem 60:1611-1616 (2017)  
Target
Name:
Cytochrome P450 1A2
Synonyms:
CP1A2_HUMAN CYPIA2 Cytochrome P(3)450 Cytochrome P450 1A2 (CYP1A2) Cytochrome P450-P3
Type:
Enzyme
Mol. Mass.:
58423.38
Organism:
Homo sapiens (Human)
Description:
P05177
Residue:
516
  
Inhibitor
Name:
BDBM50230576
Synonyms:
CHEMBL1341270
Type:
Small organic molecule
Emp. Form.:
C16H11ClF6N4O2
Mol. Mass.:
440.728
SMILES:
Cn1c2N=C(NC(c2c(=O)n(C)c1=O)(C(F)(F)F)C(F)(F)F)c1ccc(Cl)cc1
: