Target
Cytochrome P450 2D6
Ligand
BDBM50230577
Substrate
Meas. Tech.
ChEMBL_1644928 (CHEMBL3993857)
IC50
8130±n/a nM
Citation
 Nance, KDDays, ELWeaver, CDColdren, AFarmer, TDCho, HPNiswender, CMBlobaum, ALNiswender, KDLindsley, CW Discovery of a Novel Series of Orally Bioavailable and CNS Penetrant Glucagon-like Peptide-1 Receptor (GLP-1R) Noncompetitive Antagonists Based on a 1,3-Disubstituted-7-aryl-5,5-bis(trifluoromethyl)-5,8-dihydropyrimido[4,5-d]pyrimidine-2,4(1H,3H)-dione Core. J Med Chem 60:1611-1616 (2017)  
Target
Name:
Cytochrome P450 2D6
Synonyms:
CP2D6_HUMAN CYP2DL1 Cytochrome P450 2D6 (CYP2D6) P450-DB1
Type:
Protein
Mol. Mass.:
55774.82
Organism:
Homo sapiens (Human)
Description:
P10635
Residue:
497
  
Inhibitor
Name:
BDBM50230577
Synonyms:
CHEMBL4095693
Type:
Small organic molecule
Emp. Form.:
C21H13ClF6N4O3
Mol. Mass.:
518.796
SMILES:
COc1cccc(c1)C1=NC(c2c(N1)n(-c1ccc(Cl)cc1)c(=O)[nH]c2=O)(C(F)(F)F)C(F)(F)F
: