Target
Glucagon-like peptide 1 receptor
Ligand
BDBM50230578
Substrate
Meas. Tech.
ChEMBL_1644938 (CHEMBL3993867)
IC50
21000±n/a nM
Citation
 Nance, KDDays, ELWeaver, CDColdren, AFarmer, TDCho, HPNiswender, CMBlobaum, ALNiswender, KDLindsley, CW Discovery of a Novel Series of Orally Bioavailable and CNS Penetrant Glucagon-like Peptide-1 Receptor (GLP-1R) Noncompetitive Antagonists Based on a 1,3-Disubstituted-7-aryl-5,5-bis(trifluoromethyl)-5,8-dihydropyrimido[4,5-d]pyrimidine-2,4(1H,3H)-dione Core. J Med Chem 60:1611-1616 (2017)  
Target
Name:
Glucagon-like peptide 1 receptor
Synonyms:
GLP-1 receptor GLP-1R GLP1R_HUMAN Glucagon-like peptide 1 receptor (GLP-1)
Type:
Enzyme
Mol. Mass.:
53035.78
Organism:
Homo sapiens (Human)
Description:
P43220
Residue:
463
  
Inhibitor
Name:
BDBM50230578
Synonyms:
CHEMBL1628665
Type:
Small organic molecule
Emp. Form.:
C28H21FN3NaO5
Mol. Mass.:
521.4716
SMILES:
[Na+].COc1ccc2c(c1)N(C(=O)[C@@]2(CCC([O-])=O)NC(=O)c1cc2ccccc2cn1)c1ccccc1F
: