Target
Glucagon-like peptide 1 receptor
Ligand
BDBM50230573
Substrate
Meas. Tech.
ChEMBL_1644914 (CHEMBL3993843)
IC50
1288±n/a nM
Citation
 Nance, KDDays, ELWeaver, CDColdren, AFarmer, TDCho, HPNiswender, CMBlobaum, ALNiswender, KDLindsley, CW Discovery of a Novel Series of Orally Bioavailable and CNS Penetrant Glucagon-like Peptide-1 Receptor (GLP-1R) Noncompetitive Antagonists Based on a 1,3-Disubstituted-7-aryl-5,5-bis(trifluoromethyl)-5,8-dihydropyrimido[4,5-d]pyrimidine-2,4(1H,3H)-dione Core. J Med Chem 60:1611-1616 (2017)  
Target
Name:
Glucagon-like peptide 1 receptor
Synonyms:
GLP-1 receptor GLP-1R GLP1R_HUMAN Glucagon-like peptide 1 receptor (GLP-1)
Type:
Enzyme
Mol. Mass.:
53035.78
Organism:
Homo sapiens (Human)
Description:
P43220
Residue:
463
  
Inhibitor
Name:
BDBM50230573
Synonyms:
CHEMBL4068337
Type:
Small organic molecule
Emp. Form.:
C19H12F6N4O2S
Mol. Mass.:
474.38
SMILES:
FC(F)(F)C1(N=C(Nc2c1c(=O)[nH]c(=O)n2Cc1ccccc1)c1cccs1)C(F)(F)F
: