Target
Glucagon-like peptide 1 receptor
Ligand
BDBM50230574
Substrate
Meas. Tech.
ChEMBL_1644914 (CHEMBL3993843)
IC50
7200±n/a nM
Citation
 Nance, KDDays, ELWeaver, CDColdren, AFarmer, TDCho, HPNiswender, CMBlobaum, ALNiswender, KDLindsley, CW Discovery of a Novel Series of Orally Bioavailable and CNS Penetrant Glucagon-like Peptide-1 Receptor (GLP-1R) Noncompetitive Antagonists Based on a 1,3-Disubstituted-7-aryl-5,5-bis(trifluoromethyl)-5,8-dihydropyrimido[4,5-d]pyrimidine-2,4(1H,3H)-dione Core. J Med Chem 60:1611-1616 (2017)  
Target
Name:
Glucagon-like peptide 1 receptor
Synonyms:
GLP-1 receptor GLP-1R GLP1R_HUMAN Glucagon-like peptide 1 receptor (GLP-1)
Type:
Enzyme
Mol. Mass.:
53035.78
Organism:
Homo sapiens (Human)
Description:
P43220
Residue:
463
  
Inhibitor
Name:
BDBM50230574
Synonyms:
CHEMBL4103452
Type:
Small organic molecule
Emp. Form.:
C19H18F6N4O3
Mol. Mass.:
464.3616
SMILES:
COc1cccc(c1)C1=NC(c2c(N1)n(CC(C)C)c(=O)[nH]c2=O)(C(F)(F)F)C(F)(F)F
: