Target
Cytochrome P450 3A4
Ligand
BDBM50230577
Substrate
Meas. Tech.
ChEMBL_1644927 (CHEMBL3993856)
IC50
16440±n/a nM
Citation
 Nance, KDDays, ELWeaver, CDColdren, AFarmer, TDCho, HPNiswender, CMBlobaum, ALNiswender, KDLindsley, CW Discovery of a Novel Series of Orally Bioavailable and CNS Penetrant Glucagon-like Peptide-1 Receptor (GLP-1R) Noncompetitive Antagonists Based on a 1,3-Disubstituted-7-aryl-5,5-bis(trifluoromethyl)-5,8-dihydropyrimido[4,5-d]pyrimidine-2,4(1H,3H)-dione Core. J Med Chem 60:1611-1616 (2017)  
Target
Name:
Cytochrome P450 3A4
Synonyms:
Albendazole monooxygenase CP3A4_HUMAN CYP3A4 CYPIIIA4 Cytochrome P450 3A4 (CYP3A4) Nifedipine oxidase Taurochenodeoxycholate 6-alpha-hydroxylase
Type:
Enzyme
Mol. Mass.:
57349.57
Organism:
Homo sapiens (Human)
Description:
Residue:
503
  
Inhibitor
Name:
BDBM50230577
Synonyms:
CHEMBL4095693
Type:
Small organic molecule
Emp. Form.:
C21H13ClF6N4O3
Mol. Mass.:
518.796
SMILES:
COc1cccc(c1)C1=NC(c2c(N1)n(-c1ccc(Cl)cc1)c(=O)[nH]c2=O)(C(F)(F)F)C(F)(F)F
: