Target
Cytochrome P450 2D6
Ligand
BDBM50230575
Substrate
Meas. Tech.
ChEMBL_1644928 (CHEMBL3993857)
IC50
21200±n/a nM
Citation
 Nance, KDDays, ELWeaver, CDColdren, AFarmer, TDCho, HPNiswender, CMBlobaum, ALNiswender, KDLindsley, CW Discovery of a Novel Series of Orally Bioavailable and CNS Penetrant Glucagon-like Peptide-1 Receptor (GLP-1R) Noncompetitive Antagonists Based on a 1,3-Disubstituted-7-aryl-5,5-bis(trifluoromethyl)-5,8-dihydropyrimido[4,5-d]pyrimidine-2,4(1H,3H)-dione Core. J Med Chem 60:1611-1616 (2017)  
Target
Name:
Cytochrome P450 2D6
Synonyms:
CP2D6_HUMAN CYP2DL1 Cytochrome P450 2D6 (CYP2D6) P450-DB1
Type:
Protein
Mol. Mass.:
55774.82
Organism:
Homo sapiens (Human)
Description:
P10635
Residue:
497
  
Inhibitor
Name:
BDBM50230575
Synonyms:
CHEMBL4079193
Type:
Small organic molecule
Emp. Form.:
C16H11F6N5O4
Mol. Mass.:
451.2801
SMILES:
Cn1c2NC(=NC(c2c(=O)n(C)c1=O)(C(F)(F)F)C(F)(F)F)c1cccc(c1)[N+]([O-])=O
: