Target
Amine oxidase [flavin-containing] B
Ligand
BDBM10989
Substrate
Meas. Tech.
ChEMBL_1645423 (CHEMBL3994352)
IC50
10.0±n/a nM
Citation
 Luo, LLi, YQiang, XCao, ZXu, RYang, XXiao, GSong, QTan, ZDeng, Y Multifunctional thioxanthone derivatives with acetylcholinesterase, monoamine oxidases andß-amyloid aggregation inhibitory activities as potential agents against Alzheimer's disease. Bioorg Med Chem 25:1997-2009 (2017)  
Target
Name:
Amine oxidase [flavin-containing] B
Synonyms:
AOFB_HUMAN MAOB Monoamine oxidase type B (MAO B) Monoamine oxidase type B (MAOB)
Type:
Protein
Mol. Mass.:
58768.76
Organism:
Homo sapiens (Human)
Description:
P27338
Residue:
520
  
Inhibitor
Name:
BDBM10989
Synonyms:
(1R)-N-(prop-2-yn-1-yl)-2,3-dihydro-1H-inden-1-amine Rasagiline | US9034303, Rasagiline
Type:
Small organic molecule
Emp. Form.:
C12H13N
Mol. Mass.:
171.2383
SMILES:
C#CCN[C@@H]1CCc2ccccc12
: