Target
Ectonucleotide pyrophosphatase/phosphodiesterase family member 2
Ligand
BDBM50233155
Substrate
Meas. Tech.
ChEBML_1649803
IC50
56±n/a nM
Citation
 Banerjee, SNorman, DDLee, SCParrill, ALPham, TCBaker, DLTigyi, GJMiller, DD Highly Potent Non-Carboxylic Acid Autotaxin Inhibitors Reduce Melanoma Metastasis and Chemotherapeutic Resistance of Breast Cancer Stem Cells. J Med Chem 60:1309-1324 (2017)  
Target
Name:
Ectonucleotide pyrophosphatase/phosphodiesterase family member 2
Synonyms:
ATX Autotaxin (ATX) ENPP2 Ectonucleotide Pyrophosphatase/Phosphodiesterase 2 (ENPP2) Extracellular lysophospholipase D PDNP2
Type:
Enzyme
Mol. Mass.:
99007.13
Organism:
Homo sapiens (Human)
Description:
Q13822
Residue:
863
  
Inhibitor
Name:
BDBM50233155
Synonyms:
CHEMBL4080953 | US11124490, Compound 28b
Type:
Small organic molecule
Emp. Form.:
C18H16Cl4FN3O3S
Mol. Mass.:
515.213
SMILES:
CN1CCN(CC1)S(=O)(=O)c1cc(C(=O)Nc2cc(Cl)c(F)c(Cl)c2)c(Cl)cc1Cl
: