Target
Ectonucleotide pyrophosphatase/phosphodiesterase family member 2
Ligand
BDBM50187687
Substrate
Meas. Tech.
ChEMBL_1649787 (CHEMBL3998921)
IC50
117±n/a nM
Citation
 Banerjee, SNorman, DDLee, SCParrill, ALPham, TCBaker, DLTigyi, GJMiller, DD Highly Potent Non-Carboxylic Acid Autotaxin Inhibitors Reduce Melanoma Metastasis and Chemotherapeutic Resistance of Breast Cancer Stem Cells. J Med Chem 60:1309-1324 (2017)  
Target
Name:
Ectonucleotide pyrophosphatase/phosphodiesterase family member 2
Synonyms:
ATX Autotaxin (ATX) ENPP2 Ectonucleotide Pyrophosphatase/Phosphodiesterase 2 (ENPP2) Extracellular lysophospholipase D PDNP2
Type:
Enzyme
Mol. Mass.:
99007.13
Organism:
Homo sapiens (Human)
Description:
Q13822
Residue:
863
  
Inhibitor
Name:
BDBM50187687
Synonyms:
CHEMBL3828733 | US11124490, Compound 918013
Type:
Small organic molecule
Emp. Form.:
C17H15Cl2FN2O4S
Mol. Mass.:
433.281
SMILES:
Fc1cccc(NC(=O)c2cc(c(Cl)cc2Cl)S(=O)(=O)N2CCOCC2)c1
: