Target
Ectonucleotide pyrophosphatase/phosphodiesterase family member 2
Ligand
BDBM50233176
Substrate
Meas. Tech.
ChEMBL_1649787 (CHEMBL3998921)
IC50
>1000±n/a nM
Citation
 Banerjee, SNorman, DDLee, SCParrill, ALPham, TCBaker, DLTigyi, GJMiller, DD Highly Potent Non-Carboxylic Acid Autotaxin Inhibitors Reduce Melanoma Metastasis and Chemotherapeutic Resistance of Breast Cancer Stem Cells. J Med Chem 60:1309-1324 (2017)  
Target
Name:
Ectonucleotide pyrophosphatase/phosphodiesterase family member 2
Synonyms:
ATX Autotaxin (ATX) ENPP2 Ectonucleotide Pyrophosphatase/Phosphodiesterase 2 (ENPP2) Extracellular lysophospholipase D PDNP2
Type:
Enzyme
Mol. Mass.:
99007.13
Organism:
Homo sapiens (Human)
Description:
Q13822
Residue:
863
  
Inhibitor
Name:
BDBM50233176
Synonyms:
CHEMBL4068789
Type:
Small organic molecule
Emp. Form.:
C17H13Cl2F2N3O3S
Mol. Mass.:
448.271
SMILES:
Fc1cc2nc([nH]c2cc1F)-c1cc(c(Cl)cc1Cl)S(=O)(=O)N1CCOCC1
: