Target
Ectonucleotide pyrophosphatase/phosphodiesterase family member 2
Ligand
BDBM50233157
Substrate
Meas. Tech.
ChEMBL_1649787 (CHEMBL3998921)
IC50
67±n/a nM
Citation
 Banerjee, SNorman, DDLee, SCParrill, ALPham, TCBaker, DLTigyi, GJMiller, DD Highly Potent Non-Carboxylic Acid Autotaxin Inhibitors Reduce Melanoma Metastasis and Chemotherapeutic Resistance of Breast Cancer Stem Cells. J Med Chem 60:1309-1324 (2017)  
Target
Name:
Ectonucleotide pyrophosphatase/phosphodiesterase family member 2
Synonyms:
ATX Autotaxin (ATX) ENPP2 Ectonucleotide Pyrophosphatase/Phosphodiesterase 2 (ENPP2) Extracellular lysophospholipase D PDNP2
Type:
Enzyme
Mol. Mass.:
99007.13
Organism:
Homo sapiens (Human)
Description:
Q13822
Residue:
863
  
Inhibitor
Name:
BDBM50233157
Synonyms:
CHEMBL4097500 | US11124490, Compound 28a
Type:
Small organic molecule
Emp. Form.:
C18H16Cl2F3N3O3S
Mol. Mass.:
482.304
SMILES:
CN1CCN(CC1)S(=O)(=O)c1cc(C(=O)Nc2cc(F)c(F)c(F)c2)c(Cl)cc1Cl
: