Target
Ectonucleotide pyrophosphatase/phosphodiesterase family member 2
Ligand
BDBM50233158
Substrate
Meas. Tech.
ChEMBL_1649787 (CHEMBL3998921)
IC50
>1000±n/a nM
Citation
 Banerjee, SNorman, DDLee, SCParrill, ALPham, TCBaker, DLTigyi, GJMiller, DD Highly Potent Non-Carboxylic Acid Autotaxin Inhibitors Reduce Melanoma Metastasis and Chemotherapeutic Resistance of Breast Cancer Stem Cells. J Med Chem 60:1309-1324 (2017)  
Target
Name:
Ectonucleotide pyrophosphatase/phosphodiesterase family member 2
Synonyms:
ATX Autotaxin (ATX) ENPP2 Ectonucleotide Pyrophosphatase/Phosphodiesterase 2 (ENPP2) Extracellular lysophospholipase D PDNP2
Type:
Enzyme
Mol. Mass.:
99007.13
Organism:
Homo sapiens (Human)
Description:
Q13822
Residue:
863
  
Inhibitor
Name:
BDBM50233158
Synonyms:
CHEMBL4097621
Type:
Small organic molecule
Emp. Form.:
C19H17ClF2N2O7S
Mol. Mass.:
490.862
SMILES:
COc1cc(Cl)c(cc1S(=O)(=O)N1CCOCC1)C(=O)Nc1cc(F)c(C(O)=O)c(F)c1
: