Target
Amine oxidase [flavin-containing] A
Ligand
BDBM67454
Substrate
Meas. Tech.
ChEMBL_1650374 (CHEMBL3999508)
Ki
422±n/a nM
Citation
 Lee, HWRyu, HWKang, MGPark, DOh, SRKim, H Selective inhibition of monoamine oxidase A by purpurin, an anthraquinone. Bioorg Med Chem Lett 27:1136-1140 (2017)  
Target
Name:
Amine oxidase [flavin-containing] A
Synonyms:
AOFA_HUMAN MAO-A Monoamine oxidase Monoamine oxidase type A (MAO A) Monoamine oxidase type A (MAOA)
Type:
Protein
Mol. Mass.:
59689.53
Organism:
Homo sapiens (Human)
Description:
P21397
Residue:
527
  
Inhibitor
Name:
BDBM67454
Synonyms:
1,2,4-trihydroxy-9,10-anthraquinone 1,2,4-tris(oxidanyl)anthracene-9,10-dione SMR001306802 hsp90_173 | purpurin
Type:
Small organic molecule
Emp. Form.:
C14H8O5
Mol. Mass.:
256.2103
SMILES:
Oc1cc(O)c2C(=O)c3ccccc3C(=O)c2c1O
: