Target
Hormone-sensitive lipase
Ligand
BDBM50233399
Substrate
Meas. Tech.
ChEMBL_1650803 (CHEMBL3999937)
IC50
8.0±n/a nM
Citation
 Ogiyama, TYamaguchi, MKurikawa, NHonzumi, SYamamoto, YSugiyama, DTakakusa, HInoue, SI Identification of a novel hormone sensitive lipase inhibitor with a reduced potential of reactive metabolites formation. Bioorg Med Chem 25:2234-2243 (2017)  
Target
Name:
Hormone-sensitive lipase
Synonyms:
HSL Hormone-sensitive lipase (HSL) LIPS_HUMAN
Type:
Protein
Mol. Mass.:
116599.07
Organism:
Homo sapiens (Human)
Description:
Q05469
Residue:
1076
  
Inhibitor
Name:
BDBM50233399
Synonyms:
CHEMBL4101186
Type:
Small organic molecule
Emp. Form.:
C25H23BClF3N2O4
Mol. Mass.:
518.72
SMILES:
CC1(C)OB(OC1(C)C)c1cc(Cl)ccc1NC(=O)c1ccc(Oc2ccc(cc2)C(F)(F)F)nc1
: