Target
Hormone-sensitive lipase
Ligand
BDBM50233407
Substrate
Meas. Tech.
ChEMBL_1650803 (CHEMBL3999937)
IC50
21±n/a nM
Citation
 Ogiyama, TYamaguchi, MKurikawa, NHonzumi, SYamamoto, YSugiyama, DTakakusa, HInoue, SI Identification of a novel hormone sensitive lipase inhibitor with a reduced potential of reactive metabolites formation. Bioorg Med Chem 25:2234-2243 (2017)  
Target
Name:
Hormone-sensitive lipase
Synonyms:
HSL Hormone-sensitive lipase (HSL) LIPS_HUMAN
Type:
Protein
Mol. Mass.:
116599.07
Organism:
Homo sapiens (Human)
Description:
Q05469
Residue:
1076
  
Inhibitor
Name:
BDBM50233407
Synonyms:
CHEMBL4100819
Type:
Small organic molecule
Emp. Form.:
C25H24BF3N2O5
Mol. Mass.:
500.275
SMILES:
CC1(C)OB(OC1(C)C)c1ccccc1NC(=O)c1ccc(Oc2cccc(OC(F)(F)F)c2)nc1
: