Target
Hormone-sensitive lipase
Ligand
BDBM50233408
Substrate
Meas. Tech.
ChEMBL_1650803 (CHEMBL3999937)
IC50
40±n/a nM
Citation
 Ogiyama, TYamaguchi, MKurikawa, NHonzumi, SYamamoto, YSugiyama, DTakakusa, HInoue, SI Identification of a novel hormone sensitive lipase inhibitor with a reduced potential of reactive metabolites formation. Bioorg Med Chem 25:2234-2243 (2017)  
Target
Name:
Hormone-sensitive lipase
Synonyms:
HSL Hormone-sensitive lipase (HSL) LIPS_HUMAN
Type:
Protein
Mol. Mass.:
116599.07
Organism:
Homo sapiens (Human)
Description:
Q05469
Residue:
1076
  
Inhibitor
Name:
BDBM50233408
Synonyms:
CHEMBL4090644
Type:
Small organic molecule
Emp. Form.:
C26H27BF3N3O4
Mol. Mass.:
513.316
SMILES:
CN(c1ccc(OC(F)(F)F)cc1)c1ccc(cn1)C(=O)Nc1ccccc1B1OC(C)(C)C(C)(C)O1
: