Target
Xanthine dehydrogenase/oxidase
Ligand
BDBM50233808
Substrate
Meas. Tech.
ChEMBL_1651249 (CHEMBL4000504)
Ki
3430±n/a nM
Citation
 Tang, HJZhang, XWYang, LLi, WLi, JHWang, JXChen, J Synthesis and evaluation of xanthine oxidase inhibitory and antioxidant activities of 2-arylbenzo[b]furan derivatives based on salvianolic acid C. Eur J Med Chem 124:637-648 (2016)  
Target
Name:
Xanthine dehydrogenase/oxidase
Synonyms:
XD XDHA XO Xanthine dehydrogenase/oxidase | Xanthine oxidase
Type:
Enzyme
Mol. Mass.:
146441.21
Organism:
Homo sapiens (Human)
Description:
P47989
Residue:
1333
  
Inhibitor
Name:
BDBM50233808
Synonyms:
CHEMBL4086701 | US11021454, Compound 6e
Type:
Small organic molecule
Emp. Form.:
C26H21NO8
Mol. Mass.:
475.4468
SMILES:
OC(=O)[C@H](Cc1ccc(O)cc1)NC(=O)\C=C\c1ccc(O)c2oc(cc12)-c1ccc(O)c(O)c1
: