Target
Cytochrome P450 2D6
Ligand
BDBM50234038
Substrate
Meas. Tech.
ChEMBL_1652003 (CHEMBL4001258)
IC50
>5000±n/a nM
Citation
 Markwalder, JASeitz, SPBlat, YElkin, LHunt, JTPabalan, JGJure-Kunkel, MNVite, GDCovello, K Identification and optimization of a novel series of indoleamine 2,3-dioxygenase inhibitors. Bioorg Med Chem Lett 27:582-585 (2017)  
Target
Name:
Cytochrome P450 2D6
Synonyms:
CP2D6_HUMAN CYP2DL1 Cytochrome P450 2D6 (CYP2D6) P450-DB1
Type:
Protein
Mol. Mass.:
55774.82
Organism:
Homo sapiens (Human)
Description:
P10635
Residue:
497
  
Inhibitor
Name:
BDBM50234038
Synonyms:
CHEMBL4097275
Type:
Small organic molecule
Emp. Form.:
C31H27F3N2O5
Mol. Mass.:
564.5517
SMILES:
CC(C)(C)c1ccccc1Oc1ccc(cc1NC(=O)Nc1ccc(OC(F)(F)F)cc1)-c1cccc(c1)C(O)=O
: