Target
Amine oxidase [flavin-containing] B
Ligand
BDBM10989
Substrate
Meas. Tech.
ChEMBL_1654034 (CHEMBL4003400)
IC50
83±n/a nM
Citation
 Li, YQiang, XLuo, LYang, XXiao, GLiu, QAi, JTan, ZDeng, Y Aurone Mannich base derivatives as promising multifunctional agents with acetylcholinesterase inhibition, anti-ß-amyloid aggragation and neuroprotective properties for the treatment of Alzheimer's disease. Eur J Med Chem 126:762-775 (2017)  
Target
Name:
Amine oxidase [flavin-containing] B
Synonyms:
AOFB_HUMAN MAOB Monoamine oxidase type B (MAO B) Monoamine oxidase type B (MAOB)
Type:
Protein
Mol. Mass.:
58768.76
Organism:
Homo sapiens (Human)
Description:
P27338
Residue:
520
  
Inhibitor
Name:
BDBM10989
Synonyms:
(1R)-N-(prop-2-yn-1-yl)-2,3-dihydro-1H-inden-1-amine Rasagiline | US9034303, Rasagiline
Type:
Small organic molecule
Emp. Form.:
C12H13N
Mol. Mass.:
171.2383
SMILES:
C#CCN[C@@H]1CCc2ccccc12
: