Target
Sodium/glucose cotransporter 1
Ligand
BDBM176693
Substrate
Meas. Tech.
ChEMBL_1654379 (CHEMBL4003745)
IC50
1.1±n/a nM
Citation
 Goodwin, NCDing, ZMHarrison, BAStrobel, EDHarris, ALSmith, MThompson, AYXiong, WMseeh, FBruce, DJDiaz, DGopinathan, SLi, LO'Neill, EThiel, MWilson, AGCarson, KGPowell, DRRawlins, DB Discovery of LX2761, a Sodium-Dependent Glucose Cotransporter 1 (SGLT1) Inhibitor Restricted to the Intestinal Lumen, for the Treatment of Diabetes. J Med Chem 60:710-721 (2017)  
Target
Name:
Sodium/glucose cotransporter 1
Synonyms:
High affinity sodium-glucose cotransporter Na(+)/glucose cotransporter 1 SGLT1 Sodium-dependent glucose cotransporter 1 (SGLT1) Sodium/glucose cotransporter 1 (SGLT1) | Solute carrier family 5 member 1
Type:
Protein
Mol. Mass.:
73503.78
Organism:
Homo sapiens (Human)
Description:
P13866
Residue:
664
  
Inhibitor
Name:
BDBM176693
Synonyms:
US9688710, 116 4-(4-(2-methyl-5-((2S,3R,4R,5S,6R)-3,4,5-trihydroxy-6-(methylthio)tetrahydro-2H-pyran-2-yl)benzyl)phenyl)-N-(1-(4-methylpiperazine-1-carbonyl)cyclopropyl)butanamide
Type:
Small organic molecule
Emp. Form.:
C33H45N3O6S
Mol. Mass.:
611.792
SMILES:
CS[C@H]1O[C@H]([C@H](O)[C@@H](O)[C@@H]1O)c1ccc(C)c(Cc2ccc(CCCC(=O)NC3(CC3)C(=O)N3CCN(C)CC3)cc2)c1
: