Target
Tyrosine-protein kinase ABL1
Ligand
BDBM206104
Substrate
Meas. Tech.
ChEMBL_1654857 (CHEMBL4004223)
IC50
>50000±n/a nM
Citation
 Miura, TMatsuo, AMuraoka, TIde, MMorikami, KKamikawa, TNishihara, MKashiwagi, H Identification of a selective inhibitor of transforming growth factorß-activated kinase 1 by biosensor-based screening of focused libraries. Bioorg Med Chem Lett 27:1031-1036 (2017)  
Target
Name:
Tyrosine-protein kinase ABL1
Synonyms:
ABL ABL1_HUMAN JTK7 Proto-oncogene tyrosine-protein kinase ABL1 Tyrosine-protein kinase ABL V-abl Abelson murine leukemia viral oncogene homolog 1 p150 | tyrosine-protein kinase ABL1 isoform a
Type:
Enzyme
Mol. Mass.:
122897.30
Organism:
Homo sapiens (Human)
Description:
P00519
Residue:
1130
  
Inhibitor
Name:
BDBM206104
Synonyms:
US9255110, 17
Type:
Small organic molecule
Emp. Form.:
C17H12N4O2S
Mol. Mass.:
336.368
SMILES:
COc1cc2ncccc2cc1NC(=O)c1csc2cncnc12
: