Target
Protein kinase C beta type
Ligand
BDBM206104
Substrate
Meas. Tech.
ChEMBL_1654867 (CHEMBL4004233)
IC50
>50000±n/a nM
Citation
 Miura, TMatsuo, AMuraoka, TIde, MMorikami, KKamikawa, TNishihara, MKashiwagi, H Identification of a selective inhibitor of transforming growth factorß-activated kinase 1 by biosensor-based screening of focused libraries. Bioorg Med Chem Lett 27:1031-1036 (2017)  
Target
Name:
Protein kinase C beta type
Synonyms:
KPCB_HUMAN PKC beta PKCB PRKCB1 Protein kinase C beta type | Protein kinase C beta type II (PRKCB2)
Type:
Enzyme
Mol. Mass.:
76873.67
Organism:
Homo sapiens (Human)
Description:
The recombinant human PKC enzymes were produced using a baculovirus expression system in SF9 cells
Residue:
671
  
Inhibitor
Name:
BDBM206104
Synonyms:
US9255110, 17
Type:
Small organic molecule
Emp. Form.:
C17H12N4O2S
Mol. Mass.:
336.368
SMILES:
COc1cc2ncccc2cc1NC(=O)c1csc2cncnc12
: