Target
Mitogen-activated protein kinase kinase kinase 7
Ligand
BDBM206104
Substrate
Meas. Tech.
ChEMBL_1654824 (CHEMBL4004190)
Kd
150±n/a nM
Citation
 Miura, TMatsuo, AMuraoka, TIde, MMorikami, KKamikawa, TNishihara, MKashiwagi, H Identification of a selective inhibitor of transforming growth factorß-activated kinase 1 by biosensor-based screening of focused libraries. Bioorg Med Chem Lett 27:1031-1036 (2017)  
Target
Name:
Mitogen-activated protein kinase kinase kinase 7
Synonyms:
M3K7_HUMAN Mitogen-activated protein kinase kinase kinase 7 TAK1/TAB1 Transforming growth factor-beta-activated kinase 1 (TAK1)
Type:
Protein
Mol. Mass.:
67199.89
Organism:
Homo sapiens (Human)
Description:
O43318
Residue:
606
  
Inhibitor
Name:
BDBM206104
Synonyms:
US9255110, 17
Type:
Small organic molecule
Emp. Form.:
C17H12N4O2S
Mol. Mass.:
336.368
SMILES:
COc1cc2ncccc2cc1NC(=O)c1csc2cncnc12
: