Target
Mast/stem cell growth factor receptor Kit
Ligand
BDBM206104
Substrate
Meas. Tech.
ChEMBL_1654837 (CHEMBL4004203)
IC50
>50000±n/a nM
Citation
 Miura, TMatsuo, AMuraoka, TIde, MMorikami, KKamikawa, TNishihara, MKashiwagi, H Identification of a selective inhibitor of transforming growth factorß-activated kinase 1 by biosensor-based screening of focused libraries. Bioorg Med Chem Lett 27:1031-1036 (2017)  
Target
Name:
Mast/stem cell growth factor receptor Kit
Synonyms:
CD117 antigen KIT Mast/stem cell growth factor receptor Kit (cKIT) Proto-oncogene tyrosine-protein kinase Kit Stem cell growth factor receptor Tyrosine-protein kinase Kit c-kit v-kit Hardy-Zuckerman 4 feline sarcoma viral oncogene homolog
Type:
Protein
Mol. Mass.:
109869.37
Organism:
Homo sapiens (Human)
Description:
P10721
Residue:
976
  
Inhibitor
Name:
BDBM206104
Synonyms:
US9255110, 17
Type:
Small organic molecule
Emp. Form.:
C17H12N4O2S
Mol. Mass.:
336.368
SMILES:
COc1cc2ncccc2cc1NC(=O)c1csc2cncnc12
: