Target
Hepatocyte growth factor receptor
Ligand
BDBM206104
Substrate
Meas. Tech.
ChEMBL_1654844 (CHEMBL4004210)
IC50
>50000±n/a nM
Citation
 Miura, TMatsuo, AMuraoka, TIde, MMorikami, KKamikawa, TNishihara, MKashiwagi, H Identification of a selective inhibitor of transforming growth factorß-activated kinase 1 by biosensor-based screening of focused libraries. Bioorg Med Chem Lett 27:1031-1036 (2017)  
Target
Name:
Hepatocyte growth factor receptor
Synonyms:
Hepatocyte growth factor receptor Hepatocyte growth factor receptor (c-MET) MET Met proto-oncogene (hepatocyte growth factor receptor) Tyrosine-protein kinase Met (c-Met) c-Met kinase
Type:
Protein
Mol. Mass.:
155559.73
Organism:
Homo sapiens (Human)
Description:
P08581
Residue:
1390
  
Inhibitor
Name:
BDBM206104
Synonyms:
US9255110, 17
Type:
Small organic molecule
Emp. Form.:
C17H12N4O2S
Mol. Mass.:
336.368
SMILES:
COc1cc2ncccc2cc1NC(=O)c1csc2cncnc12
: