Target
Polycomb protein EED
Ligand
BDBM50235646
Substrate
Meas. Tech.
ChEMBL_1657638 (CHEMBL4007108)
Ki
>50000±n/a nM
Citation
 Curtin, MLPliushchev, MALi, HQTorrent, MDietrich, JDJakob, CGZhu, HZhao, HWang, YJi, ZClark, RFSarris, KASelvaraju, SShaw, BAlgire, MAHe, YRichardson, PLSweis, RFSun, CChiang, GGMichaelides, MR SAR of amino pyrrolidines as potent and novel protein-protein interaction inhibitors of the PRC2 complex through EED binding. Bioorg Med Chem Lett 27:1576-1583 (2017)  
Target
Name:
Polycomb protein EED
Synonyms:
EED WAIT-1 hEED
Type:
Protein
Mol. Mass.:
50201.68
Organism:
Homo sapiens (Human)
Description:
O75530
Residue:
441
  
Inhibitor
Name:
BDBM50235646
Synonyms:
CHEMBL4087547
Type:
Small organic molecule
Emp. Form.:
C23H27N5
Mol. Mass.:
373.494
SMILES:
CN(C)[C@H]1CN(Cc2ccn3ccnc3c2)C[C@@H]1c1cn(C)c2ccccc12
: