Target
Tyrosine-protein kinase JAK3
Ligand
BDBM50235820
Substrate
Meas. Tech.
ChEMBL_1658104 (CHEMBL4007716)
IC50
>10000±n/a nM
Citation
 Hoemann, MWilson, NArgiriadi, MBanach, DBurchat, ACalderwood, DClapham, BCox, PDuignan, DBKonopacki, DSomal, GVasudevan, A Synthesis and optimization of furano[3,2-d]pyrimidines as selective spleen tyrosine kinase (Syk) inhibitors. Bioorg Med Chem Lett 26:5562-5567 (2016)  
Target
Name:
Tyrosine-protein kinase JAK3
Synonyms:
JAK-3 JAK3_HUMAN Janus kinase 3 (JAK3) L-JAK | Leukocyte janus kinase
Type:
Protein
Mol. Mass.:
125111.08
Organism:
Homo sapiens (Human)
Description:
P52333
Residue:
1124
  
Inhibitor
Name:
BDBM50235820
Synonyms:
CHEMBL4066664
Type:
Small organic molecule
Emp. Form.:
C15H11F3N6O
Mol. Mass.:
348.2826
SMILES:
FC(F)(F)CNc1nc(Nc2ccc3cn[nH]c3c2)nc2ccoc12
: