Target
Tyrosine-protein kinase Lck
Ligand
BDBM50235820
Substrate
Meas. Tech.
ChEMBL_1658108 (CHEMBL4007720)
IC50
7790±n/a nM
Citation
 Hoemann, MWilson, NArgiriadi, MBanach, DBurchat, ACalderwood, DClapham, BCox, PDuignan, DBKonopacki, DSomal, GVasudevan, A Synthesis and optimization of furano[3,2-d]pyrimidines as selective spleen tyrosine kinase (Syk) inhibitors. Bioorg Med Chem Lett 26:5562-5567 (2016)  
Target
Name:
Tyrosine-protein kinase Lck
Synonyms:
2.7.10.2 LCK_HUMAN Leukocyte C-terminal Src kinase Lymphocyte-specific protein tyrosine kinase Protein YT16 Proto-oncogene tyrosine-protein kinase LCK T cell-specific protein-tyrosine kinase
Type:
Mol. Mass.:
57987.83
Organism:
Homo sapiens (Human)
Description:
P06239
Residue:
509
  
Inhibitor
Name:
BDBM50235820
Synonyms:
CHEMBL4066664
Type:
Small organic molecule
Emp. Form.:
C15H11F3N6O
Mol. Mass.:
348.2826
SMILES:
FC(F)(F)CNc1nc(Nc2ccc3cn[nH]c3c2)nc2ccoc12
: