Target
Insulin-like growth factor 1 receptor
Ligand
BDBM50235820
Substrate
Meas. Tech.
ChEMBL_1658100 (CHEMBL4007712)
IC50
>10000±n/a nM
Citation
 Hoemann, MWilson, NArgiriadi, MBanach, DBurchat, ACalderwood, DClapham, BCox, PDuignan, DBKonopacki, DSomal, GVasudevan, A Synthesis and optimization of furano[3,2-d]pyrimidines as selective spleen tyrosine kinase (Syk) inhibitors. Bioorg Med Chem Lett 26:5562-5567 (2016)  
Target
Name:
Insulin-like growth factor 1 receptor
Synonyms:
CD_antigen=CD221 IGF1R Insulin-like growth factor 1 receptor (IGF1R) Insulin-like growth factor 1 receptor alpha chain Insulin-like growth factor I receptor | Insulin-like growth factor receptor (IGFR)
Type:
Protein
Mol. Mass.:
154776.79
Organism:
Homo sapiens (Human)
Description:
P08069
Residue:
1367
  
Inhibitor
Name:
BDBM50235820
Synonyms:
CHEMBL4066664
Type:
Small organic molecule
Emp. Form.:
C15H11F3N6O
Mol. Mass.:
348.2826
SMILES:
FC(F)(F)CNc1nc(Nc2ccc3cn[nH]c3c2)nc2ccoc12
: