Target
Casein kinase I isoform alpha
Ligand
BDBM50235820
Substrate
Meas. Tech.
ChEMBL_1658085 (CHEMBL4007697)
IC50
5220±n/a nM
Citation
 Hoemann, MWilson, NArgiriadi, MBanach, DBurchat, ACalderwood, DClapham, BCox, PDuignan, DBKonopacki, DSomal, GVasudevan, A Synthesis and optimization of furano[3,2-d]pyrimidines as selective spleen tyrosine kinase (Syk) inhibitors. Bioorg Med Chem Lett 26:5562-5567 (2016)  
Target
Name:
Casein kinase I isoform alpha
Synonyms:
CK1 CSNK1A1 Casein kinase 1 alpha (CK1 alpha) KC1A_HUMAN
Type:
Serine/threonine-protein kinase
Mol. Mass.:
38936.59
Organism:
Homo sapiens (Human)
Description:
P48729
Residue:
337
  
Inhibitor
Name:
BDBM50235820
Synonyms:
CHEMBL4066664
Type:
Small organic molecule
Emp. Form.:
C15H11F3N6O
Mol. Mass.:
348.2826
SMILES:
FC(F)(F)CNc1nc(Nc2ccc3cn[nH]c3c2)nc2ccoc12
: