Target
[Pyruvate dehydrogenase (acetyl-transferring)] kinase isozyme 1, mitochondrial
Ligand
BDBM50236521
Substrate
Meas. Tech.
ChEBML_1659261
Ki
90±n/a nM
Citation
 Brough, PABaker, LBedford, SBrown, KChavda, SChell, VD'Alessandro, JDavies, NGDavis, BLe Strat, LMacias, ATMaddox, DMahon, PCMassey, AJMatassova, NMcKenna, SMeissner, JWMoore, JDMurray, JBNorthfield, CJParry, CParsons, RRoughley, SDShaw, TSimmonite, HStokes, SSurgenor, AStefaniak, ERobertson, AWang, YWebb, PWhitehead, NWood, M Application of Off-Rate Screening in the Identification of Novel Pan-Isoform Inhibitors of Pyruvate Dehydrogenase Kinase. J Med Chem 60:2271-2286 (2017)  
Target
Name:
[Pyruvate dehydrogenase (acetyl-transferring)] kinase isozyme 1, mitochondrial
Synonyms:
PDHK1 PDK1_HUMAN Pyruvate dehydrogenase kinase 1 (PDK1) | Pyruvate dehydrogenase kinase isoform 1
Type:
Protein
Mol. Mass.:
49255.23
Organism:
Homo sapiens (Human)
Description:
Q15118
Residue:
436
  
Inhibitor
Name:
BDBM50236521
Synonyms:
CHEMBL3715843
Type:
Small organic molecule
Emp. Form.:
C17H16FNO3
Mol. Mass.:
301.3122
SMILES:
C[C@H]1CCc2cc(F)ccc2N1C(=O)c1ccc(O)cc1O
: