Target
[Pyruvate dehydrogenase (acetyl-transferring)] kinase isozyme 1, mitochondrial
Ligand
BDBM265209
Substrate
Meas. Tech.
ChEBML_1659261
Ki
136±n/a nM
Citation
 Brough, PABaker, LBedford, SBrown, KChavda, SChell, VD'Alessandro, JDavies, NGDavis, BLe Strat, LMacias, ATMaddox, DMahon, PCMassey, AJMatassova, NMcKenna, SMeissner, JWMoore, JDMurray, JBNorthfield, CJParry, CParsons, RRoughley, SDShaw, TSimmonite, HStokes, SSurgenor, AStefaniak, ERobertson, AWang, YWebb, PWhitehead, NWood, M Application of Off-Rate Screening in the Identification of Novel Pan-Isoform Inhibitors of Pyruvate Dehydrogenase Kinase. J Med Chem 60:2271-2286 (2017)  
Target
Name:
[Pyruvate dehydrogenase (acetyl-transferring)] kinase isozyme 1, mitochondrial
Synonyms:
PDHK1 PDK1_HUMAN Pyruvate dehydrogenase kinase 1 (PDK1) | Pyruvate dehydrogenase kinase isoform 1
Type:
Protein
Mol. Mass.:
49255.23
Organism:
Homo sapiens (Human)
Description:
Q15118
Residue:
436
  
Inhibitor
Name:
BDBM265209
Synonyms:
US10413550, Example 41j US9718793, 41j
Type:
Small organic molecule
Emp. Form.:
C24H26ClN3O5
Mol. Mass.:
471.933
SMILES:
CCNC(=O)c1noc(c1-c1ccc(CN2CCOCC2)cc1C)-c1cc(Cl)c(O)cc1O
: