Target
Heat shock protein HSP 90-alpha
Ligand
BDBM50236525
Substrate
Meas. Tech.
ChEMBL_1659253 (CHEMBL4008865)
Ki
184±n/a nM
Citation
 Brough, PABaker, LBedford, SBrown, KChavda, SChell, VD'Alessandro, JDavies, NGDavis, BLe Strat, LMacias, ATMaddox, DMahon, PCMassey, AJMatassova, NMcKenna, SMeissner, JWMoore, JDMurray, JBNorthfield, CJParry, CParsons, RRoughley, SDShaw, TSimmonite, HStokes, SSurgenor, AStefaniak, ERobertson, AWang, YWebb, PWhitehead, NWood, M Application of Off-Rate Screening in the Identification of Novel Pan-Isoform Inhibitors of Pyruvate Dehydrogenase Kinase. J Med Chem 60:2271-2286 (2017)  
Target
Name:
Heat shock protein HSP 90-alpha
Synonyms:
HS90A_HUMAN HSP86 HSP90AA1 HSPCA Heat shock 86 kDa Heat shock protein HSP 90-alpha (HSP90) LAP-2 Lipopolysaccharide-associated protein 2 heat shock protein 90kDa alpha (cytosolic), class A member 1 isoform 2
Type:
Molecular Chaperone
Mol. Mass.:
84623.45
Organism:
Homo sapiens (Human)
Description:
P07900
Residue:
732
  
Inhibitor
Name:
BDBM50236525
Synonyms:
CHEMBL4097485
Type:
Small organic molecule
Emp. Form.:
C24H20N2O7
Mol. Mass.:
448.4248
SMILES:
CN(C(=O)c1ccc(O)cc1O)c1ccc(cc1)C(=O)N1CC(Oc2ccccc12)C(O)=O
: