Target
Disintegrin and metalloproteinase domain-containing protein 17
Ligand
BDBM50181008
Substrate
Meas. Tech.
ChEMBL_1661172 (CHEMBL4010784)
IC50
158±n/a nM
Citation
 Ouvry, GBerton, YBhurruth-Alcor, YBonnary, LBouix-Peter, CBouquet, KBourotte, MChambon, SComino, CDeprez, BDuvert, DDuvert, GHacini-Rachinel, FHarris, CSLuzy, APMathieu, AMillois, CPascau, JPinto, APolge, GReitz, AReversé, KRosignoli, CTaquet, NHennequin, LF Identification of novel TACE inhibitors compatible with topical application. Bioorg Med Chem Lett 27:1848-1853 (2017)  
Target
Name:
Disintegrin and metalloproteinase domain-containing protein 17
Synonyms:
ADA17_HUMAN CSVP Disintegrin and metalloproteinase domain-containing protein 17 (ADAM17) TNF-alpha convertase TNF-alpha-converting enzyme (TACE) Tumor necrosis factor-α converting enzyme (TACE)
Type:
Enzyme
Mol. Mass.:
93007.89
Organism:
Homo sapiens (Human)
Description:
Residue:
824
  
Inhibitor
Name:
BDBM50181008
Synonyms:
(S)-N-hydroxy-4-(4-(4-hydroxybut-2-ynyloxy)phenylsulfonyl)-2,2-dimethylthiomorpholine-3-carboxamide TMI-05 US9365529, Apratastat
Type:
Small organic molecule
Emp. Form.:
C17H22N2O6S2
Mol. Mass.:
414.496
SMILES:
CC1(C)SCCN([C@H]1C(=O)NO)S(=O)(=O)c1ccc(OCC#CCO)cc1
: