Target
Cytochrome P450 2C9
Ligand
BDBM257207
Substrate
Meas. Tech.
ChEMBL_1660519 (CHEMBL4010131)
IC50
>50000±n/a nM
Citation
 Scott, JDDeMong, DEGreshock, TJBasu, KDai, XHarris, JHruza, ALi, SWLin, SILiu, HMacala, MKHu, ZMei, HZhang, HWalsh, PPoirier, MShi, ZCXiao, LAgnihotri, GBaptista, MAColumbus, JFell, MJHyde, LAKuvelkar, RLin, YMirescu, CMorrow, JAYin, ZZhang, XZhou, XChang, RKEmbrey, MWSanders, JMTiscia, HEDrolet, REKern, JTSur, SMRenger, JJBilodeau, MTKennedy, MEParker, EMStamford, AWNargund, RMcCauley, JAMiller, MW Discovery of a 3-(4-Pyrimidinyl) Indazole (MLi-2), an Orally Available and Selective Leucine-Rich Repeat Kinase 2 (LRRK2) Inhibitor that Reduces Brain Kinase Activity. J Med Chem 60:2983-2992 (2017)  
Target
Name:
Cytochrome P450 2C9
Synonyms:
(R)-limonene 6-monooxygenase CP2C9_HUMAN CYP2C9 Cytochrome P450 2C9 (CYP2C9 ) P-450MP P450 PB-1 | S-mephenytoin 4-hydroxylase
Type:
Enzyme
Mol. Mass.:
55636.33
Organism:
Homo sapiens (Human)
Description:
P11712
Residue:
490
  
Inhibitor
Name:
BDBM257207
Synonyms:
US9493440, 51
Type:
Small organic molecule
Emp. Form.:
C21H25N5O2
Mol. Mass.:
379.4555
SMILES:
C[C@H]1CN(C[C@@H](C)O1)c1cc(ncn1)-c1n[nH]c2ccc(OC3(C)CC3)cc12
: