Target
Leucine-rich repeat serine/threonine-protein kinase 2
Ligand
BDBM50236735
Substrate
Meas. Tech.
ChEMBL_1660538 (CHEMBL4010150)
IC50
728±n/a nM
Citation
 Scott, JDDeMong, DEGreshock, TJBasu, KDai, XHarris, JHruza, ALi, SWLin, SILiu, HMacala, MKHu, ZMei, HZhang, HWalsh, PPoirier, MShi, ZCXiao, LAgnihotri, GBaptista, MAColumbus, JFell, MJHyde, LAKuvelkar, RLin, YMirescu, CMorrow, JAYin, ZZhang, XZhou, XChang, RKEmbrey, MWSanders, JMTiscia, HEDrolet, REKern, JTSur, SMRenger, JJBilodeau, MTKennedy, MEParker, EMStamford, AWNargund, RMcCauley, JAMiller, MW Discovery of a 3-(4-Pyrimidinyl) Indazole (MLi-2), an Orally Available and Selective Leucine-Rich Repeat Kinase 2 (LRRK2) Inhibitor that Reduces Brain Kinase Activity. J Med Chem 60:2983-2992 (2017)  
Target
Name:
Leucine-rich repeat serine/threonine-protein kinase 2
Synonyms:
Dardarin LRRK2_HUMAN Leucine-rich repeat serine/threonine-protein kinase 2 PARK8
Type:
Protein
Mol. Mass.:
286113.20
Organism:
Homo sapiens (Human)
Description:
Q5S007
Residue:
2527
  
Inhibitor
Name:
BDBM50236735
Synonyms:
CHEMBL4060479
Type:
Small organic molecule
Emp. Form.:
C18H15N5
Mol. Mass.:
301.3452
SMILES:
Nc1cc(ccn1)-c1n[nH]c2ccc(Nc3ccccc3)cc12
: