Target
Epidermal growth factor receptor
Ligand
BDBM50237055
Substrate
Meas. Tech.
ChEBML_1661463
IC50
>150±n/a nM
Citation
 Hamed, MMDarwish, SSHerrmann, JAbadi, AHEngel, M First Bispecific Inhibitors of the Epidermal Growth Factor Receptor Kinase and the NF-żB Activity As Novel Anticancer Agents. J Med Chem 60:2853-2868 (2017)  
Target
Name:
Epidermal growth factor receptor
Synonyms:
EGF Receptor Substrate EGFR_HUMAN ERBB1 Epidermal Growth Factor Receptor erbB-1 Epidermal growth factor receptor (EGFR) HER1 Proto-oncogene c-ErbB-1 Tyrosine-Protein Kinase ErbB-1
Type:
Receptor Kinase Domain
Mol. Mass.:
134279.59
Organism:
Homo sapiens (Human)
Description:
P00533
Residue:
1210
  
Inhibitor
Name:
BDBM50237055
Synonyms:
CHEMBL4061372
Type:
Small organic molecule
Emp. Form.:
C25H25N5S
Mol. Mass.:
427.565
SMILES:
CC(C)c1ccc(Nc2ncnc3ccc(NC(=S)NCc4ccccc4)cc23)cc1
: