Target
Carbonic anhydrase 1
Ligand
BDBM50237192
Substrate
Meas. Tech.
ChEMBL_1660629 (CHEMBL4010241)
Ki
3490±n/a nM
Citation
 Mishra, CBKumari, SAngeli, AMonti, SMBuonanno, MTiwari, MSupuran, CT Discovery of Benzenesulfonamides with Potent Human Carbonic Anhydrase Inhibitory and Effective Anticonvulsant Action: Design, Synthesis, and Pharmacological Assessment. J Med Chem 60:2456-2469 (2017)  
Target
Name:
Carbonic anhydrase 1
Synonyms:
CA-I CAB Carbonate dehydratase I Carbonic anhydrase 1 (CA I) Carbonic anhydrase 1 (Recombinant CA I) Carbonic anhydrase B Carbonic anhydrase I (CA I) Carbonic anhydrase I (CAI) Carbonic anhydrase isoenzyme I (hCA I) | hCA
Type:
Enzyme
Mol. Mass.:
28873.37
Organism:
Homo sapiens (Human)
Description:
P00915
Residue:
261
  
Inhibitor
Name:
BDBM50237192
Synonyms:
CHEMBL4072947
Type:
Small organic molecule
Emp. Form.:
C19H24FN5O3S
Mol. Mass.:
421.489
SMILES:
NS(=O)(=O)c1ccc(NC(=O)NCCN2CCN(CC2)c2ccc(F)cc2)cc1
: